Posts by pandaadnap

    Hi


    I tried multiple things
    1. I tried to compile for RPi2 (following the doc on github). I get an error

    Code
    1. [b]INSTALL[/b]    libc [b](target)[/b]      [b]INSTALL[/b]    toolchain [b](target)[/b]          [b]INSTALL[/b]    configtools [b](host)[/b]          [b]INSTALL[/b]    make [b](host)[/b]          [b]INSTALL[/b]    xz [b](host)[/b]          [b]INSTALL[/b]    sed [b](host)[/b]          [b]INSTALL[/b]    pkg-config [b](host)[/b]          [b]INSTALL[/b]    autoconf [b](host)[/b]          [b]INSTALL[/b]    automake [b](host)[/b]          [b]INSTALL[/b]    libtool [b](host)[/b]   [HEADERS] include   [HEADERS] libxfsBuilding includegmake[2]: Nothing to be done for 'include'.Building libxfs    [TEST]    CRC32    [CC]     rdwr.lo    [CC]     trans.lo    [CC]     util.loIn file included from [b]/home/moi/libreelec/libreelec_escalade_rpi2/build.LibreELEC-RPi2.arm-8.0-devel/toolchain/armv7ve-libreelec-linux-gnueabi/sysroot/usr/include/features.h:392:0[/b],                 from [b]/home/moi/libreelec/libreelec_escalade_rpi2/build.LibreELEC-RPi2.arm-8.0-devel/toolchain/armv7ve-libreelec-linux-gnueabi/sysroot/usr/include/stdio.h:27[/b],                 from [b]../include/platform_defs.h:24[/b],                 from [b]crc32.c:36[/b]:[b]/home/moi/libreelec/libreelec_escalade_rpi2/build.LibreELEC-RPi2.arm-8.0-devel/toolchain/armv7ve-libreelec-linux-gnueabi/sysroot/usr/include/gnu/stubs.h:7:29:[/b] [b]fatal error: [/b]gnu/stubs-soft.h: No such file or directorycompilation terminated.Makefile:124: recipe for target 'crc32selftest' failedgmake[3]: *** [crc32selftest] Error 1gmake[3]: *** Waiting for unfinished jobs....include/buildrules:35: recipe for target 'libxfs' failedgmake[2]: *** [libxfs] Error 2Makefile:70: recipe for target 'default' failedmake[1]: *** [default] Error 2make[1]: Leaving directory '/home/moi/libreelec/libreelec_escalade_rpi2/build.LibreELEC-RPi2.arm-8.0-devel/xfsprogs-dev-53cefc4'Makefile:12 : la recette pour la cible « image » a échouéemake: *** [image] Erreur 1


    I don't get this error when compiling for Odroid.



    2. When I compile for Odroid c2, I get an error


    Error:


    I will try to see if I find the correct flag tomorrow.
    Thanks


    pandaadnap


    My tree have a lot of packages not present in upstream LibreELEC, I'm only testing with RPi3/Intel. Always include a full log, the error you mention is not the complete error and does not indicate what went wrong.


    escalade


    Thanks


    Tail of logs is